Target
Carbonic anhydrase 1
Ligand
BDBM50345225
Substrate
Meas. Tech.
ChEMBL_751964 (CHEMBL1785906)
Ki
339±n/a nM
Citation
 Hen, NBialer, MYagen, BMaresca, AAggarwal, MRobbins, AHMcKenna, RScozzafava, ASupuran, CT Anticonvulsant 4-aminobenzenesulfonamide derivatives with branched-alkylamide moieties: X-ray crystallography and inhibition studies of human carbonic anhydrase isoforms I, II, VII, and XIV. J Med Chem 54:3977-81 (2011)  
Target
Name:
Carbonic anhydrase 1
Synonyms:
CA-I CAB Carbonate dehydratase I Carbonic anhydrase 1 (CA I) Carbonic anhydrase 1 (Recombinant CA I) Carbonic anhydrase B Carbonic anhydrase I (CA I) Carbonic anhydrase I (CAI) Carbonic anhydrase isoenzyme I (hCA I) | hCA
Type:
Enzyme
Mol. Mass.:
28873.37
Organism:
Homo sapiens (Human)
Description:
P00915
Residue:
261
  
Inhibitor
Name:
BDBM50345225
Synonyms:
2,2-Dimethyl-N-(4-sulfamoylbenzyl)propionamide N-(4-sulfamoylbenzyl)pivalamide
Type:
Small organic molecule
Emp. Form.:
C12H18N2O3S
Mol. Mass.:
270.348
SMILES:
CC(C)(C)C(=O)NCc1ccc(cc1)S(N)(=O)=O
: