Target
Carbonic anhydrase 2
Ligand
BDBM50345218
Substrate
Meas. Tech.
ChEMBL_751965 (CHEMBL1785907)
Ki
339±n/a nM
Citation
 Hen, NBialer, MYagen, BMaresca, AAggarwal, MRobbins, AHMcKenna, RScozzafava, ASupuran, CT Anticonvulsant 4-aminobenzenesulfonamide derivatives with branched-alkylamide moieties: X-ray crystallography and inhibition studies of human carbonic anhydrase isoforms I, II, VII, and XIV. J Med Chem 54:3977-81 (2011)  
Target
Name:
Carbonic anhydrase 2
Synonyms:
CA-II CAC Carbonate dehydratase II Carbonic anhydrase 2 (CA-II) Carbonic anhydrase C Carbonic anhydrase II (CA-II) Carbonic anhydrase II (hCA II) | Carbonic anhydrase isoenzyme II (hCA II)
Type:
Enzyme
Mol. Mass.:
29250.71
Organism:
Homo sapiens (Human)
Description:
P00918
Residue:
260
  
Inhibitor
Name:
BDBM50345218
Synonyms:
2-Methyl-N-(4-sulfamoylphenyl)butyramide CHEMBL1085467
Type:
Small organic molecule
Emp. Form.:
C11H16N2O3S
Mol. Mass.:
256.321
SMILES:
CCC(C)C(=O)Nc1ccc(cc1)S(N)(=O)=O
: