Target
Carbonic anhydrase 7
Ligand
BDBM50345222
Substrate
Meas. Tech.
ChEMBL_751966 (CHEMBL1785908)
Ki
60±n/a nM
Citation
 Hen, NBialer, MYagen, BMaresca, AAggarwal, MRobbins, AHMcKenna, RScozzafava, ASupuran, CT Anticonvulsant 4-aminobenzenesulfonamide derivatives with branched-alkylamide moieties: X-ray crystallography and inhibition studies of human carbonic anhydrase isoforms I, II, VII, and XIV. J Med Chem 54:3977-81 (2011)  
Target
Name:
Carbonic anhydrase 7
Synonyms:
CA-VII CAH7_HUMAN Carbonic anhydrase Carbonic anhydrase VII (CA VII)
Type:
Enzyme
Mol. Mass.:
29664.11
Organism:
Homo sapiens (Human)
Description:
Human cloned isozyme.
Residue:
264
  
Inhibitor
Name:
BDBM50345222
Synonyms:
2-ethyl-N-(4-sulfamoylphenyl)pentanamide | CHEMBL1084063
Type:
Small organic molecule
Emp. Form.:
C13H20N2O3S
Mol. Mass.:
284.374
SMILES:
CCCC(CC)C(=O)Nc1ccc(cc1)S(N)(=O)=O
: