Target
Androgen receptor
Ligand
BDBM50345229
Substrate
Meas. Tech.
ChEMBL_752063 (CHEMBL1786227)
Ki
2000±n/a nM
Citation
 Duke, CBJones, ABohl, CEDalton, JTMiller, DD Unexpected binding orientation of bulky-B-ring anti-androgens and implications for future drug targets. J Med Chem 54:3973-6 (2011)  
Target
Name:
Androgen receptor
Synonyms:
ANDR_HUMAN Androgen Receptor Androgen receptor/Baculoviral IAP repeat-containing protein 2 Dihydrotestosterone receptor Nuclear receptor subfamily 3 group C member 4
Type:
Receptor
Mol. Mass.:
99185.27
Organism:
Homo sapiens (Human)
Description:
CHO cells were stably transfected with human AR gene.
Residue:
920
  
Inhibitor
Name:
BDBM50345229
Synonyms:
(R)-3-(biphenyl-2-ylsulfonyl)-N-(4-cyano-3-(trifluoromethyl)phenyl)-2-hydroxy-2-methylpropanamide | CHEMBL1782496
Type:
Small organic molecule
Emp. Form.:
C24H19F3N2O4S
Mol. Mass.:
488.479
SMILES:
C[C@](O)(CS(=O)(=O)c1ccccc1-c1ccccc1)C(=O)Nc1ccc(C#N)c(c1)C(F)(F)F
: