Target
Sodium/glucose cotransporter 2
Ligand
BDBM50345357
Substrate
Meas. Tech.
ChEMBL_751703 (CHEMBL1788054)
IC50
3.38±n/a nM
Citation
 Lee, SHKim, MJLee, SHKim, JPark, HJLee, J Thiazolylmethyl ortho-substituted phenyl glucoside library as novel C-aryl glucoside SGLT2 inhibitors. Eur J Med Chem 46:2662-75 (2011)  
Target
Name:
Sodium/glucose cotransporter 2
Synonyms:
Na(+)/glucose cotransporter 2 SGLT2 Sodium-Dependent Glucose Cotransporter 2 (SGLT2) Solute carrier family 5 member 2
Type:
Protein
Mol. Mass.:
72902.00
Organism:
Homo sapiens (Human)
Description:
P31639
Residue:
672
  
Inhibitor
Name:
BDBM50345357
Synonyms:
(2S,3R,4R,5S,6R)-2-(2-(Allyloxy)-4-chloro-5-((5-phenylthiazol-2-yl)methyl)phenyl)-6-(hydroxymethyl)tetrahydro-2H-pyran-3,4,5-triol | CHEMBL1784289
Type:
Small organic molecule
Emp. Form.:
C25H26ClNO6S
Mol. Mass.:
503.995
SMILES:
OC[C@H]1O[C@H]([C@H](O)[C@@H](O)[C@@H]1O)c1cc(Cc2ncc(s2)-c2ccccc2)c(Cl)cc1OCC=C
: