Target
Fibroblast growth factor receptor 1
Ligand
BDBM50345461
Substrate
Meas. Tech.
ChEMBL_751986 (CHEMBL1785928)
IC50
>10000±n/a nM
Citation
 Chen, ZWang, XZhu, WCao, XTong, LLi, HXie, HXu, YTan, SKuang, DDing, JQian, X Acenaphtho[1,2-b]pyrrole-based selective fibroblast growth factor receptors 1 (FGFR1) inhibitors: design, synthesis, and biological activity. J Med Chem 54:3732-45 (2011)  
Target
Name:
Fibroblast growth factor receptor 1
Synonyms:
BFGFR Basic fibroblast growth factor receptor 1 (FGFR1) CEK FGFR-1 FGFR-1, (FL) FGFR1_HUMAN FLT2 Fibroblast growth factor receptor 1 (FGFR-1) Fms-like tyrosine kinase 2 N-sam bFGF-R | c-fgr
Type:
Receptor
Mol. Mass.:
91861.70
Organism:
Homo sapiens (Human)
Description:
P11362
Residue:
822
  
Inhibitor
Name:
BDBM50345461
Synonyms:
CHEMBL1784733 | Ethyl 8-Oxo-3-(2-(thiazolidin-3-yl)ethylthio)-8H-acenaphtho[1,2-b]pyrrole-9-carboxylate
Type:
Small organic molecule
Emp. Form.:
C22H20N2O3S2
Mol. Mass.:
424.536
SMILES:
CCOC(=O)c1c2c3ccc(SCCN4CCSC4)c4cccc(c2nc1=O)c34
: