Target
Myosin-J heavy chain
Ligand
BDBM50345503
Substrate
Meas. Tech.
ChEMBL_751034 (CHEMBL1786819)
IC50
100000±n/a nM
Citation
 Preller, MChinthalapudi, KMartin, RKnolker, HJManstein, DJ Inhibition of Myosin ATPase activity by halogenated pseudilins: a structure-activity study. J Med Chem 54:3675-85 (2011)  
Target
Name:
Myosin-J heavy chain
Synonyms:
MYOJ_DICDI myo5B | myoJ
Type:
PROTEIN
Mol. Mass.:
258694.10
Organism:
Dictyostelium discoideum
Description:
ChEMBL_751034
Residue:
2245
  
Inhibitor
Name:
BDBM50345503
Synonyms:
2,4-DICHLORO-6-(3,4,5-TRICHLORO-1H-PYRROL-2YL)PHENOL pentachloropseudilin
Type:
Small organic molecule
Emp. Form.:
C10H4Cl5NO
Mol. Mass.:
331.41
SMILES:
Oc1c(Cl)cc(Cl)cc1-c1[nH]c(Cl)c(Cl)c1Cl
: