Target
A disintegrin and metalloproteinase with thrombospondin motifs 5
Ligand
BDBM50337735
Substrate
Meas. Tech.
ChEMBL_751101 (CHEMBL1787038)
IC50
23±n/a nM
Citation
 De Savi, CPape, ASawyer, YMilne, DDavies, CCumming, JGTing, ALamont, SSmith, PDTart, JPage, KMoore, P Orally active achiral N-hydroxyformamide inhibitors of ADAM-TS4 (aggrecanase-1) and ADAM-TS5 (aggrecanase-2) for the treatment of osteoarthritis. Bioorg Med Chem Lett 21:3301-6 (2011)  
Target
Name:
A disintegrin and metalloproteinase with thrombospondin motifs 5
Synonyms:
A disintegrin and metalloproteinase with thrombospondin motifs 5 (ADAMTS-5) ADAMTS5 ATS5_HUMAN Metalloproteinase with thrombospondin motifs 5 (ADAMTS-5)
Type:
Enzyme
Mol. Mass.:
101769.09
Organism:
Homo sapiens (Human)
Description:
Q9UNA0
Residue:
930
  
Inhibitor
Name:
BDBM50337735
Synonyms:
CHEMBL1615187 US10322143, Compound 8m
Type:
Small organic molecule
Emp. Form.:
C23H34FN5O5S
Mol. Mass.:
511.61
SMILES:
C[C@@H](C[C@@](C)(CS(=O)(=O)N1CCC(CCc2c(C)noc2C)CC1)N(O)C=O)c1ncc(F)cn1
: