Target
Metabotropic glutamate receptor 5
Ligand
BDBM50345564
Substrate
Meas. Tech.
ChEMBL_751566 (CHEMBL1787492)
IC50
2.64±n/a nM
Citation
 Alagille, DDaCosta, HChen, YHemstapat, KRodriguez, ABaldwin, RMConn, JPTamagnan, GD Potent mGluR5 antagonists: pyridyl and thiazolyl-ethynyl-3,5-disubstituted-phenyl series. Bioorg Med Chem Lett 21:3243-7 (2011)  
Target
Name:
Metabotropic glutamate receptor 5
Synonyms:
GRM5_RAT Grm5 Mglur5 metabotropic glutamate 5/1-C metabotropic glutamate 5a
Type:
Enzyme
Mol. Mass.:
131900.14
Organism:
Rattus norvegicus (Rat)
Description:
P31424
Residue:
1203
  
Inhibitor
Name:
BDBM50345564
Synonyms:
3-(2-(5-methylpyridin-2-yl)ethynyl)-5-nitrobenzonitrile | CHEMBL1784610
Type:
Small organic molecule
Emp. Form.:
C15H9N3O2
Mol. Mass.:
263.2509
SMILES:
Cc1ccc(nc1)C#Cc1cc(cc(c1)[N+]([O-])=O)C#N
: