Target
Breast cancer type 1 susceptibility protein
Ligand
BDBM50345630
Substrate
Meas. Tech.
ChEMBL_752252 (CHEMBL1785941)
IC50
30100±n/a nM
Citation
 Yuan, ZKumar, EAKizhake, SNatarajan, A Structure-activity relationship studies to probe the phosphoprotein binding site on the carboxy terminal domains of the breast cancer susceptibility gene 1. J Med Chem 54:4264-8 (2011)  
Target
Name:
Breast cancer type 1 susceptibility protein
Synonyms:
BRCA1 RNF53
Type:
PROTEIN
Mol. Mass.:
207672.68
Organism:
Homo sapiens (Human)
Description:
ChEMBL_812733
Residue:
1863
  
Inhibitor
Name:
BDBM50345630
Synonyms:
(S)-2-acetamido-3-((S)-2-((S)-1-((S)-1-amino-1-oxo-3-phenylpropan-2-ylamino)-3-hydroxy-1-oxopropan-2-ylcarbamoyl)pyrrolidin-1-yl)-3-oxopropyl dihydrogen phosphate | CHEMBL1784775
Type:
Small organic molecule
Emp. Form.:
C22H32N5O10P
Mol. Mass.:
557.4907
SMILES:
CC(=O)N[C@@H](COP(O)(O)=O)C(=O)N1CCC[C@H]1C(=O)N[C@@H](CO)C(=O)N[C@@H](Cc1ccccc1)C(N)=O
: