Target
Mitogen-activated protein kinase 14
Ligand
BDBM50345782
Substrate
Meas. Tech.
ChEMBL_749304 (CHEMBL1785239)
IC50
317±n/a nM
Citation
 Ravindra, GKAchaiah, GSastry, GN Molecular modeling studies of phenoxypyrimidinyl imidazoles as p38 kinase inhibitors using QSAR and docking. Eur J Med Chem 43:830-8 (2008)  
Target
Name:
Mitogen-activated protein kinase 14
Synonyms:
CSAID-binding protein CSBP1 CSPB1 MAP kinase 14 MAP kinase p38 alpha MAPK14 MK14_HUMAN Mitogen-activated protein kinase p38 alpha Stress-activated protein kinase 2a | p38 MAP kinase alpha/beta
Type:
Serine/threonine-protein kinase
Mol. Mass.:
41286.76
Organism:
Homo sapiens (Human)
Description:
Q16539
Residue:
360
  
Inhibitor
Name:
BDBM50345782
Synonyms:
4-(4-(4-(4-fluorophenyl)-1-(piperidin-4-yl)-1H-imidazol-5-yl)pyrimidin-2-yloxy)phenyl benzoate | CHEMBL1785005
Type:
Small organic molecule
Emp. Form.:
C31H26FN5O3
Mol. Mass.:
535.5682
SMILES:
Fc1ccc(cc1)-c1ncn(C2CCNCC2)c1-c1ccnc(Oc2ccc(OC(=O)c3ccccc3)cc2)n1
: