Target
Glyceraldehyde-3-phosphate dehydrogenase, glycosomal
Ligand
BDBM50345792
Substrate
Meas. Tech.
ChEMBL_749305 (CHEMBL1785240)
IC50
200000±n/a nM
Citation
 Pereira, JMSeverino, RPVieira, PCFernandes, JBda Silva, MFZottis, AAndricopulo, ADOliva, GCorrêa, AG Anacardic acid derivatives as inhibitors of glyceraldehyde-3-phosphate dehydrogenase from Trypanosoma cruzi. Bioorg Med Chem 16:8889-95 (2008)  
Target
Name:
Glyceraldehyde-3-phosphate dehydrogenase, glycosomal
Synonyms:
G3PG_TRYCR
Type:
PROTEIN
Mol. Mass.:
39070.68
Organism:
Trypanosoma cruzi
Description:
ChEMBL_973242
Residue:
359
  
Inhibitor
Name:
BDBM50345792
Synonyms:
2-hydroxy-6-nonylbenzoic acid | CHEMBL1784991
Type:
Small organic molecule
Emp. Form.:
C16H24O3
Mol. Mass.:
264.36
SMILES:
CCCCCCCCCc1cccc(O)c1C(O)=O
: