Target
Protein-tyrosine kinase 2-beta
Ligand
BDBM50246327
Substrate
Meas. Tech.
ChEMBL_749785 (CHEMBL1787945)
IC50
88±n/a nM
Citation
 Walker, DPZawistoski, MPMcGlynn, MALi, JCKung, DWBonnette, PCBaumann, ABuckbinder, LHouser, JABoer, JMistry, AHan, SXing, LGuzman-Perez, A Sulfoximine-substituted trifluoromethylpyrimidine analogs as inhibitors of proline-rich tyrosine kinase 2 (PYK2) show reduced hERG activity. Bioorg Med Chem Lett 19:3253-8 (2009)  
Target
Name:
Protein-tyrosine kinase 2-beta
Synonyms:
FAK2 PTK2B PTK2B protein tyrosine kinase 2 beta (PTK2B) Protein tyrosine kinase 2 beta | RAFTK
Type:
Protein
Mol. Mass.:
115868.80
Organism:
Homo sapiens (Human)
Description:
Q14289
Residue:
1009
  
Inhibitor
Name:
BDBM50246327
Synonyms:
4-(4-((1R,2R)-2-(dimethylamino)cyclopentylamino)-5-(trifluoromethyl)pyrimidin-2-ylamino)-N-methylbenzenesulfonamide CHEMBL509485
Type:
Small organic molecule
Emp. Form.:
C19H25F3N6O2S
Mol. Mass.:
458.501
SMILES:
CNS(=O)(=O)c1ccc(Nc2ncc(c(N[C@@H]3CCC[C@H]3N(C)C)n2)C(F)(F)F)cc1
: