Target
Hexokinase-4
Ligand
BDBM50346002
Substrate
Meas. Tech.
ChEMBL_750244 (CHEMBL1788085)
EC50
70±n/a nM
Citation
 Pfefferkorn, JALou, JMinich, MLFilipski, KJHe, MZhou, RAhmed, SBenbow, JPerez, AGTu, MLitchfield, JSharma, RMetzler, KBourbonais, FHuang, CBeebe, DAOates, PJ Pyridones as glucokinase activators: identification of a unique metabolic liability of the 4-sulfonyl-2-pyridone heterocycle. Bioorg Med Chem Lett 19:3247-52 (2009)  
Target
Name:
Hexokinase-4
Synonyms:
GCK Glucokinase (GK) HK IV HXK4_HUMAN Hexokinase-D
Type:
Enzyme
Mol. Mass.:
52175.81
Organism:
Homo sapiens (Human)
Description:
P35557
Residue:
465
  
Inhibitor
Name:
BDBM50346002
Synonyms:
(S)-2-(3-chloro-4-(isopropylsulfonyl)-2-oxopyridin-1(2H)-yl)-3-cyclopentyl-N-(5-methylpyridin-2-yl)propanamide | CHEMBL1783745
Type:
Small organic molecule
Emp. Form.:
C22H28ClN3O4S
Mol. Mass.:
465.993
SMILES:
CC(C)S(=O)(=O)c1ccn([C@@H](CC2CCCC2)C(=O)Nc2ccc(C)cn2)c(=O)c1Cl
: