Target
Hexokinase-4
Ligand
BDBM50346030
Substrate
Meas. Tech.
ChEMBL_750244 (CHEMBL1788085)
EC50
3500±n/a nM
Citation
 Pfefferkorn, JALou, JMinich, MLFilipski, KJHe, MZhou, RAhmed, SBenbow, JPerez, AGTu, MLitchfield, JSharma, RMetzler, KBourbonais, FHuang, CBeebe, DAOates, PJ Pyridones as glucokinase activators: identification of a unique metabolic liability of the 4-sulfonyl-2-pyridone heterocycle. Bioorg Med Chem Lett 19:3247-52 (2009)  
Target
Name:
Hexokinase-4
Synonyms:
GCK Glucokinase (GK) HK IV HXK4_HUMAN Hexokinase-D
Type:
Enzyme
Mol. Mass.:
52175.81
Organism:
Homo sapiens (Human)
Description:
P35557
Residue:
465
  
Inhibitor
Name:
BDBM50346030
Synonyms:
(S)-3-cyclopentyl-N-(5-methylpyrazin-2-yl)-2-(4-(methylsulfonyl)-2-oxopyridin-1(2H)-yl)propanamide | CHEMBL1270959
Type:
Small organic molecule
Emp. Form.:
C19H24N4O4S
Mol. Mass.:
404.483
SMILES:
Cc1cnc(NC(=O)[C@H](CC2CCCC2)n2ccc(cc2=O)S(C)(=O)=O)cn1
: