Target
Metabotropic glutamate receptor 8
Ligand
BDBM50346073
Substrate
Meas. Tech.
ChEMBL_750540 (CHEMBL1786301)
IC50
>30000±n/a nM
Citation
 Rodriguez, ALWilliams, RZhou, YLindsley, SRLe, UGrier, MDWeaver, CDConn, PJLindsley, CW Discovery and SAR of novel mGluR5 non-competitive antagonists not based on an MPEP chemotype. Bioorg Med Chem Lett 19:3209-13 (2009)  
Target
Name:
Metabotropic glutamate receptor 8
Synonyms:
GPRC1H GRM8_HUMAN Metabotropic glutamate receptor 8 | metabotropic glutamate 8
Type:
Enzyme Catalytic Domain
Mol. Mass.:
101759.58
Organism:
Homo sapiens (Human)
Description:
metabotropic glutamate 8 GRM8 HUMAN::O00222
Residue:
908
  
Inhibitor
Name:
BDBM50346073
Synonyms:
CHEMBL1783985 | cyclobutyl(2-azaspiro[5.5]undecan-2-yl)methanone
Type:
Small organic molecule
Emp. Form.:
C15H25NO
Mol. Mass.:
235.3651
SMILES:
O=C(C1CCC1)N1CCCC2(CCCCC2)C1
: