Target
Tyrosine-protein phosphatase non-receptor type 1
Ligand
BDBM50346148
Substrate
Meas. Tech.
ChEMBL_750565 (CHEMBL1786429)
IC50
2970±n/a nM
Citation
 Kumar, AMaurya, RASharma, SAhmad, PSingh, ABTamrakar, AKSrivastava, AK Design and synthesis of 3,5-diarylisoxazole derivatives as novel class of anti-hyperglycemic and lipid lowering agents. Bioorg Med Chem 17:5285-92 (2009)  
Target
Name:
Tyrosine-protein phosphatase non-receptor type 1
Synonyms:
PTN1_HUMAN PTPN1 Protein tyrosine phosphatase-1B (PTP1B) Protein-tyrosine phosphatase 1B (PTP1B) Tyrosine-protein phosphatase non-receptor type 1 (PTP1B)
Type:
Protein phosphatase
Mol. Mass.:
49963.76
Organism:
Homo sapiens (Human)
Description:
Human recombinant GST-fusion PTP1B (1-435).
Residue:
435
  
Inhibitor
Name:
BDBM50346148
Synonyms:
CHEMBL1783773 | N,N-diethyl-2-(5-methoxy-2-(3-phenylisoxazol-5-yl)phenoxy)ethanamine
Type:
Small organic molecule
Emp. Form.:
C22H26N2O3
Mol. Mass.:
366.4534
SMILES:
CCN(CC)CCOc1cc(OC)ccc1-c1cc(no1)-c1ccccc1
: