Target
Tyrosine-protein phosphatase non-receptor type 1
Ligand
BDBM50346166
Substrate
Meas. Tech.
ChEMBL_750565 (CHEMBL1786429)
IC50
6800±n/a nM
Citation
 Kumar, AMaurya, RASharma, SAhmad, PSingh, ABTamrakar, AKSrivastava, AK Design and synthesis of 3,5-diarylisoxazole derivatives as novel class of anti-hyperglycemic and lipid lowering agents. Bioorg Med Chem 17:5285-92 (2009)  
Target
Name:
Tyrosine-protein phosphatase non-receptor type 1
Synonyms:
PTN1_HUMAN PTPN1 Protein tyrosine phosphatase-1B (PTP1B) Protein-tyrosine phosphatase 1B (PTP1B) Tyrosine-protein phosphatase non-receptor type 1 (PTP1B)
Type:
Protein phosphatase
Mol. Mass.:
49963.76
Organism:
Homo sapiens (Human)
Description:
Human recombinant GST-fusion PTP1B (1-435).
Residue:
435
  
Inhibitor
Name:
BDBM50346166
Synonyms:
1-(5-methoxy-2-(3-phenylisoxazol-5-yl)phenoxy)-3-(piperidin-1-yl)propan-2-ol | CHEMBL1783790
Type:
Small organic molecule
Emp. Form.:
C24H28N2O4
Mol. Mass.:
408.4901
SMILES:
COc1ccc(-c2cc(no2)-c2ccccc2)c(OCC(O)CN2CCCCC2)c1
: