Target
Aryl hydrocarbon receptor
Ligand
BDBM50310361
Substrate
Meas. Tech.
ChEMBL_750604 (CHEMBL1786468)
EC50
200±n/a nM
Citation
 Ishikawa, MHashimoto, Y Improvement in aqueous solubility in small molecule drug discovery programs by disruption of molecular planarity and symmetry. J Med Chem 54:1539-54 (2011)  
Target
Name:
Aryl hydrocarbon receptor
Synonyms:
AHR BHLHE76 aryl hydrocarbon receptor precursor
Type:
PROTEIN
Mol. Mass.:
96143.77
Organism:
Homo sapiens (Human)
Description:
ChEMBL_1503828
Residue:
848
  
Inhibitor
Name:
BDBM50310361
Synonyms:
3-(2',6'-Difluorophenyl)-1H-naphtho[2,1-b]pyran-1-one | CHEMBL600169
Type:
Small organic molecule
Emp. Form.:
C19H10F2O2
Mol. Mass.:
308.2783
SMILES:
Fc1cccc(F)c1-c1cc(=O)c2c(ccc3ccccc23)o1
: