Target
Peroxisome proliferator-activated receptor gamma
Ligand
BDBM50131503
Substrate
Meas. Tech.
ChEMBL_750879 (CHEMBL1786324)
IC50
57±n/a nM
Citation
 Al-Najjar, BOWahab, HATengku Muhammad, TSShu-Chien, ACAhmad Noruddin, NATaha, MO Discovery of new nanomolar peroxisome proliferator-activated receptor κ activators via elaborate ligand-based modeling. Eur J Med Chem 46:2513-29 (2011)  
Target
Name:
Peroxisome proliferator-activated receptor gamma
Synonyms:
NR1C3 PPAR-gamma PPARG_HUMAN Peroxisome proliferator-activated receptor gamma (PPAR gamma) Peroxisome proliferator-activated receptor gamma (PPARĪ³) peroxisome proliferator-activated receptor gamma isoform 2
Type:
Nuclear Receptor
Mol. Mass.:
57613.46
Organism:
Homo sapiens (Human)
Description:
P37231
Residue:
505
  
Inhibitor
Name:
BDBM50131503
Synonyms:
5-{3-[3-(4-Phenoxy-2-propyl-phenoxy)-propoxy]-phenyl}-thiazolidine-2,4-dione CHEMBL94306
Type:
Small organic molecule
Emp. Form.:
C27H27NO5S
Mol. Mass.:
477.572
SMILES:
CCCc1cc(Oc2ccccc2)ccc1OCCCOc1cccc(c1)-c1sc(=O)[nH]c1O
: