Target
Peroxisome proliferator-activated receptor gamma
Ligand
BDBM50133669
Substrate
Meas. Tech.
ChEMBL_750879 (CHEMBL1786324)
IC50
85±n/a nM
Citation
 Al-Najjar, BOWahab, HATengku Muhammad, TSShu-Chien, ACAhmad Noruddin, NATaha, MO Discovery of new nanomolar peroxisome proliferator-activated receptor κ activators via elaborate ligand-based modeling. Eur J Med Chem 46:2513-29 (2011)  
Target
Name:
Peroxisome proliferator-activated receptor gamma
Synonyms:
NR1C3 PPAR-gamma PPARG_HUMAN Peroxisome proliferator-activated receptor gamma (PPAR gamma) Peroxisome proliferator-activated receptor gamma (PPARĪ³) peroxisome proliferator-activated receptor gamma isoform 2
Type:
Nuclear Receptor
Mol. Mass.:
57613.46
Organism:
Homo sapiens (Human)
Description:
P37231
Residue:
505
  
Inhibitor
Name:
BDBM50133669
Synonyms:
5-{3-[3-(4-Cycloheptyloxy-2-propyl-phenoxy)-propoxy]-phenyl}-thiazolidine-2,4-dione CHEMBL1783032
Type:
Small organic molecule
Emp. Form.:
C28H35NO5S
Mol. Mass.:
497.646
SMILES:
CCCc1cc(OC2CCCCCC2)ccc1OCCCOc1cccc(c1)-c1sc(=O)[nH]c1O
: