Target
Peroxisome proliferator-activated receptor gamma
Ligand
BDBM50346506
Substrate
Meas. Tech.
ChEMBL_750879 (CHEMBL1786324)
IC50
6440±n/a nM
Citation
 Al-Najjar, BOWahab, HATengku Muhammad, TSShu-Chien, ACAhmad Noruddin, NATaha, MO Discovery of new nanomolar peroxisome proliferator-activated receptor κ activators via elaborate ligand-based modeling. Eur J Med Chem 46:2513-29 (2011)  
Target
Name:
Peroxisome proliferator-activated receptor gamma
Synonyms:
NR1C3 PPAR-gamma PPARG_HUMAN Peroxisome proliferator-activated receptor gamma (PPAR gamma) Peroxisome proliferator-activated receptor gamma (PPARĪ³) peroxisome proliferator-activated receptor gamma isoform 2
Type:
Nuclear Receptor
Mol. Mass.:
57613.46
Organism:
Homo sapiens (Human)
Description:
P37231
Residue:
505
  
Inhibitor
Name:
BDBM50346506
Synonyms:
3-(4-(3-(2-chloro-4-methylphenoxy)propoxy)phenyl)propanoic acid | CHEMBL1783058
Type:
Small organic molecule
Emp. Form.:
C19H21ClO4
Mol. Mass.:
348.821
SMILES:
Cc1ccc(OCCCOc2ccc(CCC(O)=O)cc2)c(Cl)c1
: