Target
Nitric oxide synthase, inducible
Ligand
BDBM50346533
Substrate
Meas. Tech.
ChEMBL_750886 (CHEMBL1786331)
Kd
>40000±n/a nM
Citation
 Young, RJAlderton, WAngell, ADBeswick, PJBrown, DChambers, CLCrowe, MCDawson, JHamlett, CCHodgson, STKleanthous, SKnowles, RGRussell, LJStocker, RWoolven, JM Heteroalicyclic carboxamidines as inhibitors of inducible nitric oxide synthase; the identification of (2R)-2-pyrrolidinecarboxamidine as a potent and selective haem-co-ordinating inhibitor. Bioorg Med Chem Lett 21:3037-40 (2011)  
Target
Name:
Nitric oxide synthase, inducible
Synonyms:
HEP-NOS Inducible NO synthase NOS type II NOS2A Nitric oxide synthase, inducible (iNOS) | iNOS
Type:
Homodimer
Mol. Mass.:
131141.95
Organism:
Homo sapiens (Human)
Description:
P35228
Residue:
1153
  
Inhibitor
Name:
BDBM50346533
Synonyms:
(S)-pyrrolidine-2-carboximidamide | CHEMBL1783098
Type:
Small organic molecule
Emp. Form.:
C5H11N3
Mol. Mass.:
113.1609
SMILES:
NC(=N)[C@@H]1CCCN1
: