Target
Histone acetyltransferase p300
Ligand
BDBM50346552
Substrate
Meas. Tech.
ChEMBL_752820 (CHEMBL1798505)
Ki
400±n/a nM
Citation
 Heinke, RCarlino, LKannan, SJung, MSippl, W Computer- and structure-based lead design for epigenetic targets. Bioorg Med Chem 19:3605-15 (2011)  
Target
Name:
Histone acetyltransferase p300
Synonyms:
EP300 HIF1A/p300/CREB-binding protein P300
Type:
Protein
Mol. Mass.:
264223.04
Organism:
Homo sapiens (Human)
Description:
Q09472
Residue:
2414
  
Inhibitor
Name:
BDBM50346552
Synonyms:
CHEMBL1797936
Type:
Small organic molecule
Emp. Form.:
C24H19N3O6
Mol. Mass.:
445.4242
SMILES:
Cc1cc(-c2ccc(C=c3c(=C)[nH]n(-c4ccc(cc4)C(O)=O)c3=O)o2)c(cc1C)[N+]([O-])=O
: