Target
Histone acetyltransferase KAT2B
Ligand
BDBM50346570
Substrate
Meas. Tech.
ChEMBL_752825 (CHEMBL1798510)
IC50
4630±n/a nM
Citation
 Furdas, SDShekfeh, SBissinger, EMWagner, JMSchlimme, SValkov, VHendzel, MJung, MSippl, W Synthesis and biological testing of novel pyridoisothiazolones as histone acetyltransferase inhibitors. Bioorg Med Chem 19:3678-89 (2011)  
Target
Name:
Histone acetyltransferase KAT2B
Synonyms:
Histone acetyltransferase KAT2A/KAT2B KAT2B PCAF
Type:
PROTEIN
Mol. Mass.:
93045.76
Organism:
Homo sapiens (Human)
Description:
ChEMBL_1502838
Residue:
832
  
Inhibitor
Name:
BDBM50346570
Synonyms:
CHEMBL1795616
Type:
Small organic molecule
Emp. Form.:
C13H10N2OS
Mol. Mass.:
242.296
SMILES:
Cc1ccc(cc1)-n1sc2ncccc2c1=O
: