Target
Carbonic anhydrase 12
Ligand
BDBM10857
Substrate
Meas. Tech.
ChEMBL_753461 (CHEMBL1799891)
Ki
37±n/a nM
Citation
 Rami, MMaresca, ASmaine, FZMontero, JLScozzafava, AWinum, JYSupuran, CT Sulfonamides incorporating boroxazolidone moieties are potent inhibitors of the transmembrane, tumor-associated carbonic anhydrase isoforms IX and XII. Bioorg Med Chem Lett 21:2975-9 (2011)  
Target
Name:
Carbonic anhydrase 12
Synonyms:
CA-XII CAH12_HUMAN Carbonic anhydrase Carbonic anhydrase XII Carbonic anhydrase XII (CAXII) | Tumor antigen HOM-RCC-3.1.3
Type:
Enzyme
Mol. Mass.:
39456.00
Organism:
Homo sapiens (Human)
Description:
Catalytic domain of human cloned isozyme was used in the assay
Residue:
354
  
Inhibitor
Name:
BDBM10857
Synonyms:
4-aminobenzene-1-sulfonamide Sulfanilamide aromatic/heteroaromatic sulfonamide 2 | halogenosulfanilamide deriv. 5a
Type:
Small organic molecule
Emp. Form.:
C6H8N2O2S
Mol. Mass.:
172.205
SMILES:
Nc1ccc(cc1)S(N)(=O)=O
: