Target
Calmodulin-1
Ligand
BDBM50001888
Substrate
Meas. Tech.
ChEMBL_753876 (CHEMBL1798138)
IC50
10300±n/a nM
Citation
 Reyes-Ramírez, ALeyte-Lugo, MFigueroa, MSerrano-Alba, TGonzález-Andrade, MMata, R Synthesis, biological evaluation, and docking studies of gigantol analogs as calmodulin inhibitors. Eur J Med Chem 46:2699-708 (2011)  
Target
Name:
Calmodulin-1
Synonyms:
CALM CALM1_HUMAN CAM CAM2 Calmodulin-2
Type:
Protein
Mol. Mass.:
16813.73
Organism:
Human
Description:
P0DP23
Residue:
149
  
Inhibitor
Name:
BDBM50001888
Synonyms:
(chloropromazine) [3-(2-Chloro-phenothiazin-10-yl)-propyl]-dimethyl-amine 1-(2-Allyl-phenoxy)-3-isopropylamino-propan-2-ol 3-(2-chloro-10H-phenothiazin-10-yl)-N,N-dimethylpropan-1-amine CHLORPROMAZINE CHLORPROMAZINE HYDROCHLORIDE CHLORPROMAZINE TANNATE PROMAPAR THORAZINE [3-(2-Chloro-phenothiazin-10-yl)-propyl]-dimethyl-amine( Chlorpromazine) chloropromazine | med.21724, Compound 15
Type:
Small organic molecule
Emp. Form.:
C17H19ClN2S
Mol. Mass.:
318.864
SMILES:
CN(C)CCCN1c2ccccc2Sc2ccc(Cl)cc12
: