Target
Acetylcholinesterase
Ligand
BDBM50346858
Substrate
Meas. Tech.
ChEMBL_753797 (CHEMBL1799772)
IC50
94000±n/a nM
Citation
 Macabeo, APVidar, WSChen, XDecker, MHeilmann, JWan, BFranzblau, SGGalvez, EVAguinaldo, MACordell, GA Mycobacterium tuberculosis and cholinesterase inhibitors from Voacanga globosa. Eur J Med Chem 46:3118-23 (2011)  
Target
Name:
Acetylcholinesterase
Synonyms:
ACES_ELEEL Acetylcholinesterase (EeAChE) | ache
Type:
Enzyme
Mol. Mass.:
71812.79
Organism:
Electrophorus electricus (Electric eel)
Description:
Residue:
633
  
Inhibitor
Name:
BDBM50346858
Synonyms:
CHEMBL1797183
Type:
Small organic molecule
Emp. Form.:
C43H48N4O7
Mol. Mass.:
732.8638
SMILES:
COC(=O)C1C[C@]23CCO[C@H]2[C@@]2(C[C@@H]4C[C@]56CC(=O)O[C@H]5CCN5CC[C@]7([C@H]4N(C2)c2c7cccc2OC)[C@H]65)[C@@H](O)N2CC[C@@]4([C@H]32)C1=Nc1ccccc41
: