Target
MAP kinase-activated protein kinase 3
Ligand
BDBM50346918
Substrate
Meas. Tech.
ChEMBL_753059 (CHEMBL1798987)
IC50
>10000±n/a nM
Citation
 Devadas, BSelness, SRXing, LMadsen, HMMarrufo, LDShieh, HMessing, DMYang, JZMorgan, HMAnderson, GDWebb, EGZhang, JDevraj, RVMonahan, JB Substituted N-aryl-6-pyrimidinones: a new class of potent, selective, and orally active p38 MAP kinase inhibitors. Bioorg Med Chem Lett 21:3856-60 (2011)  
Target
Name:
MAP kinase-activated protein kinase 3
Synonyms:
3pK MAP kinase-activated protein kinase 3 (MAPKAP-K3) MAPK-activated protein kinase 3 MAPKAP kinase 3 MAPKAPK3
Type:
Serine/threonine-protein kinase
Mol. Mass.:
42991.57
Organism:
Homo sapiens (Human)
Description:
Recombinant MAPKAPK3 was phosphorylated by incubation with active p38alpha before assays.
Residue:
382
  
Inhibitor
Name:
BDBM50346918
Synonyms:
CHEMBL1738710
Type:
Small organic molecule
Emp. Form.:
C21H18ClF2N3O4
Mol. Mass.:
449.835
SMILES:
Cc1ccc(cc1-n1cnc(OCc2ccc(F)cc2F)c(Cl)c1=O)C(=O)NCCO
: