Target
Carbonic anhydrase 1
Ligand
BDBM35727
Substrate
Meas. Tech.
ChEMBL_753077 (CHEMBL1799005)
Ki
161±n/a nM
Citation
 Biswas, SAggarwal, MGüzel, ÖScozzafava, AMcKenna, RSupuran, CT Conformational variability of different sulfonamide inhibitors with thienyl-acetamido moieties attributes to differential binding in the active site of cytosolic human carbonic anhydrase isoforms. Bioorg Med Chem 19:3732-8 (2011)  
Target
Name:
Carbonic anhydrase 1
Synonyms:
CA-I CAB Carbonate dehydratase I Carbonic anhydrase 1 (CA I) Carbonic anhydrase 1 (Recombinant CA I) Carbonic anhydrase B Carbonic anhydrase I (CA I) Carbonic anhydrase I (CAI) Carbonic anhydrase isoenzyme I (hCA I) | hCA
Type:
Enzyme
Mol. Mass.:
28873.37
Organism:
Homo sapiens (Human)
Description:
P00915
Residue:
261
  
Inhibitor
Name:
BDBM35727
Synonyms:
sulfonamide deriv., 5b
Type:
Small organic molecule
Emp. Form.:
C12H11FN2O3S2
Mol. Mass.:
314.356
SMILES:
NS(=O)(=O)c1ccc(NC(=O)Cc2cccs2)c(F)c1
: