Target
Carbonic anhydrase 3
Ligand
BDBM35726
Substrate
Meas. Tech.
ChEMBL_753079 (CHEMBL1799007)
Ki
800000±n/a nM
Citation
 Biswas, SAggarwal, MGüzel, ÖScozzafava, AMcKenna, RSupuran, CT Conformational variability of different sulfonamide inhibitors with thienyl-acetamido moieties attributes to differential binding in the active site of cytosolic human carbonic anhydrase isoforms. Bioorg Med Chem 19:3732-8 (2011)  
Target
Name:
Carbonic anhydrase 3
Synonyms:
CA-III CAH3_HUMAN Carbonic Anhydrase III Carbonic anhydrase 3 (CA III) | Carbonic anhydrase III (CA III)
Type:
Enzyme
Mol. Mass.:
29562.11
Organism:
Homo sapiens (Human)
Description:
Human cloned isozyme.
Residue:
260
  
Inhibitor
Name:
BDBM35726
Synonyms:
sulfonamide deriv., 5a
Type:
Small organic molecule
Emp. Form.:
C12H12N2O3S2
Mol. Mass.:
296.365
SMILES:
NS(=O)(=O)c1ccc(NC(=O)Cc2cccs2)cc1
: