Target
ALK tyrosine kinase receptor
Ligand
BDBM50347056
Substrate
Meas. Tech.
ChEMBL_754000 (CHEMBL1798383)
IC50
>10000±n/a nM
Citation
 Zificsak, CATheroff, JPAimone, LDAngeles, TSAlbom, MSCheng, MMesaros, EFOtt, GRQuail, MRUnderiner, TLWan, WDorsey, BD Methanesulfonamido-cyclohexylamine derivatives of 2,4-diaminopyrimidine as potent ALK inhibitors. Bioorg Med Chem Lett 21:3877-80 (2011)  
Target
Name:
ALK tyrosine kinase receptor
Synonyms:
ALK ALK_HUMAN CD_antigen: CD246
Type:
Protein
Mol. Mass.:
176453.10
Organism:
Homo sapiens (Human)
Description:
Q9UM73
Residue:
1620
  
Inhibitor
Name:
BDBM50347056
Synonyms:
CHEMBL1796243
Type:
Small organic molecule
Emp. Form.:
C22H31ClN6O4S
Mol. Mass.:
511.037
SMILES:
COc1cc(ccc1Nc1ncc(Cl)c(N[C@H]2CCCC[C@@H]2NS(C)(=O)=O)n1)N1CCOCC1
: