Target
Insulin receptor
Ligand
BDBM50347069
Substrate
Meas. Tech.
ChEMBL_754002 (CHEMBL1798385)
IC50
150±n/a nM
Citation
 Zificsak, CATheroff, JPAimone, LDAngeles, TSAlbom, MSCheng, MMesaros, EFOtt, GRQuail, MRUnderiner, TLWan, WDorsey, BD Methanesulfonamido-cyclohexylamine derivatives of 2,4-diaminopyrimidine as potent ALK inhibitors. Bioorg Med Chem Lett 21:3877-80 (2011)  
Target
Name:
Insulin receptor
Synonyms:
INSR INSR_HUMAN Insulin receptor beta subunit
Type:
Receptor Tyrosine Kinase
Mol. Mass.:
156322.60
Organism:
Homo sapiens (Human)
Description:
P06213
Residue:
1382
  
Inhibitor
Name:
BDBM50347069
Synonyms:
CHEMBL1796253
Type:
Small organic molecule
Emp. Form.:
C24H33ClN6O
Mol. Mass.:
457.011
SMILES:
CCN1CCc2ccc(Nc3ncc(Cl)c(N[C@@H]4CCCC[C@H]4NC(C)=O)n3)cc2CC1
: