Target
ALK tyrosine kinase receptor
Ligand
BDBM50347074
Substrate
Meas. Tech.
ChEMBL_754000 (CHEMBL1798383)
IC50
>3000±n/a nM
Citation
 Zificsak, CATheroff, JPAimone, LDAngeles, TSAlbom, MSCheng, MMesaros, EFOtt, GRQuail, MRUnderiner, TLWan, WDorsey, BD Methanesulfonamido-cyclohexylamine derivatives of 2,4-diaminopyrimidine as potent ALK inhibitors. Bioorg Med Chem Lett 21:3877-80 (2011)  
Target
Name:
ALK tyrosine kinase receptor
Synonyms:
ALK ALK_HUMAN CD_antigen: CD246
Type:
Protein
Mol. Mass.:
176453.10
Organism:
Homo sapiens (Human)
Description:
Q9UM73
Residue:
1620
  
Inhibitor
Name:
BDBM50347074
Synonyms:
CHEMBL1796261
Type:
Small organic molecule
Emp. Form.:
C24H35ClN6O3S
Mol. Mass.:
523.091
SMILES:
COCCN1CCc2ccc(Nc3ncc(Cl)c(N[C@@H]4CCC[C@H](C4)NS(C)(=O)=O)n3)cc2CC1
: