Target
ALK tyrosine kinase receptor
Ligand
BDBM50347071
Substrate
Meas. Tech.
ChEMBL_754000 (CHEMBL1798383)
IC50
20±n/a nM
Citation
 Zificsak, CATheroff, JPAimone, LDAngeles, TSAlbom, MSCheng, MMesaros, EFOtt, GRQuail, MRUnderiner, TLWan, WDorsey, BD Methanesulfonamido-cyclohexylamine derivatives of 2,4-diaminopyrimidine as potent ALK inhibitors. Bioorg Med Chem Lett 21:3877-80 (2011)  
Target
Name:
ALK tyrosine kinase receptor
Synonyms:
ALK ALK_HUMAN CD_antigen: CD246
Type:
Protein
Mol. Mass.:
176453.10
Organism:
Homo sapiens (Human)
Description:
Q9UM73
Residue:
1620
  
Inhibitor
Name:
BDBM50347071
Synonyms:
CHEMBL1796258
Type:
Small organic molecule
Emp. Form.:
C27H41ClN6O4S
Mol. Mass.:
581.17
SMILES:
CCN([C@@H]1CCCC[C@H]1Nc1nc(Nc2cc3CCN(CCOC)CCc3cc2OC)ncc1Cl)S(C)(=O)=O
: