Target
Phosphatidylinositol 4,5-bisphosphate 3-kinase catalytic subunit alpha isoform
Ligand
BDBM50347092
Substrate
Meas. Tech.
ChEMBL_754108 (CHEMBL1798651)
Ki
0.600000±n/a nM
Citation
 Staben, STSiu, MGoldsmith, ROlivero, AGDo, SBurdick, DJHeffron, TPDotson, JSutherlin, DPZhu, BYTsui, VLe, HLee, LLesnick, JLewis, CMurray, JMNonomiya, JPang, JPrior, WWSalphati, LRouge, LSampath, DSideris, SWiesmann, CWu, P Structure-based design of thienobenzoxepin inhibitors of PI3-kinase. Bioorg Med Chem Lett 21:4054-8 (2011)  
Target
Name:
Phosphatidylinositol 4,5-bisphosphate 3-kinase catalytic subunit alpha isoform
Synonyms:
P42336 PI3-kinase subunit p110-alpha PIK3CA Phosphatidylinositol 3-kinase alpha (PI3Kalpha) Phosphatidylinositol 4,5-bisphosphate 3-kinase (PI3K) Phosphatidylinositol 4,5-bisphosphate 3-kinase catalytic subunit alpha (PI3Kalpha) Phosphatidylinositol 4,5-bisphosphate 3-kinase catalytic subunit alpha isoform (PI3-Ka) Phosphatidylinositol 4,5-bisphosphate 3-kinase catalytic subunit alpha isoform (PI3K p110alpha) Phosphatidylinositol 4,5-bisphosphate 3-kinase catalytic subunit alpha isoform (PI3K-alpha) Phosphatidylinositol 4,5-bisphosphate 3-kinase catalytic subunit alpha isoform (PI3Kalpha p110alpha) Phosphatidylinositol 4,5-bisphosphate 3-kinase catalytic subunit alpha isoform (PIK3CA) Phosphatidylinositol-4,5-bisphosphate 3-kinase catalytic subunit alpha isoform Phosphoinositide 3-Kinase (PI3K), alpha Chain A Phosphoinositide 3-kinases (PI3K) PtdIns-3-kinase p110 | p110 alpha
Type:
Enzyme Subunit
Mol. Mass.:
124294.87
Organism:
Homo sapiens (Human)
Description:
P42336
Residue:
1068
  
Inhibitor
Name:
BDBM50347092
Synonyms:
CHEMBL1796757
Type:
Small organic molecule
Emp. Form.:
C23H18ClN3O2S
Mol. Mass.:
435.926
SMILES:
CN(C(=O)c1cc2CCOc3cc(ccc3-c2s1)-c1cn[nH]c1)c1ccccc1Cl
: