Target
Mitogen-activated protein kinase 14
Ligand
BDBM50347107
Substrate
Meas. Tech.
ChEMBL_752994 (CHEMBL1798818)
IC50
5±n/a nM
Citation
 Selness, SRBoehm, TLWalker, JKDevadas, BDurley, RCKurumbail, RShieh, HXing, LHepperle, MRucker, PVJerome, KDBenson, AGMarrufo, LDMadsen, HMHitchcock, JOwen, TJChristie, LPromo, MAHickory, BSAlvira, ENaing, WBlevis-Bal, RDevraj, RVMessing, DSchindler, JFHirsch, JSaabye, MBonar, SWebb, EAnderson, GMonahan, JB Design, synthesis and activity of a potent, selective series of N-aryl pyridinone inhibitors of p38 kinase. Bioorg Med Chem Lett 21:4059-65 (2011)  
Target
Name:
Mitogen-activated protein kinase 14
Synonyms:
CSAID-binding protein CSBP1 CSPB1 MAP kinase 14 MAP kinase p38 alpha MAPK14 MK14_HUMAN Mitogen-activated protein kinase p38 alpha Stress-activated protein kinase 2a | p38 MAP kinase alpha/beta
Type:
Serine/threonine-protein kinase
Mol. Mass.:
41286.76
Organism:
Homo sapiens (Human)
Description:
Q16539
Residue:
360
  
Inhibitor
Name:
BDBM50347107
Synonyms:
CHEMBL1797210
Type:
Small organic molecule
Emp. Form.:
C19H12BrF4NO3
Mol. Mass.:
458.201
SMILES:
OCc1cc(OCc2ccc(F)cc2F)c(Br)c(=O)n1-c1c(F)cccc1F
: