Target
ADP-ribosyl cyclase/cyclic ADP-ribose hydrolase 1
Ligand
BDBM15236
Substrate
Meas. Tech.
ChEMBL_753328 (CHEMBL1799589)
IC50
24800±n/a nM
Citation
 Kellenberger, EKuhn, ISchuber, FMuller-Steffner, H Flavonoids as inhibitors of human CD38. Bioorg Med Chem Lett 21:3939-42 (2011)  
Target
Name:
ADP-ribosyl cyclase/cyclic ADP-ribose hydrolase 1
Synonyms:
CD38 Lymphocyte differentiation antigen CD38
Type:
PROTEIN
Mol. Mass.:
34333.62
Organism:
Homo sapiens (Human)
Description:
ChEMBL_1509931
Residue:
300
  
Inhibitor
Name:
BDBM15236
Synonyms:
3,5,7-trihydroxy-2-(3,4,5-trihydroxyphenyl)-4H-chromen-4-one CHEMBL164 Myricetin Myricetin (Myr) | cid_5281672
Type:
Small organic molecule
Emp. Form.:
C15H10O8
Mol. Mass.:
318.2351
SMILES:
Oc1cc(O)c2c(c1)oc(-c1cc(O)c(O)c(O)c1)c(O)c2=O
: