Target
Amine oxidase [flavin-containing] B
Ligand
BDBM50344058
Substrate
Meas. Tech.
ChEMBL_754291 (CHEMBL1798978)
IC50
1.35±n/a nM
Citation
 Matos, MJVazquez-Rodriguez, SUriarte, ESantana, LViña, D MAO inhibitory activity modulation: 3-Phenylcoumarins versus 3-benzoylcoumarins. Bioorg Med Chem Lett 21:4224-7 (2011)  
Target
Name:
Amine oxidase [flavin-containing] B
Synonyms:
AOFB_HUMAN MAOB Monoamine oxidase type B (MAO B) Monoamine oxidase type B (MAOB)
Type:
Protein
Mol. Mass.:
58768.76
Organism:
Homo sapiens (Human)
Description:
P27338
Residue:
520
  
Inhibitor
Name:
BDBM50344058
Synonyms:
6-Bromo-8-methoxy-3-(4'-methoxyphenyl)coumarin | CHEMBL1777845
Type:
Small organic molecule
Emp. Form.:
C17H13BrO4
Mol. Mass.:
361.187
SMILES:
COc1ccc(cc1)-c1cc2cc(Br)cc(OC)c2oc1=O
: