Target
Cytochrome P450 3A4
Ligand
BDBM50347387
Substrate
Meas. Tech.
ChEMBL_755387 (CHEMBL1804703)
IC50
10000±n/a nM
Citation
 Moffat, DPatel, SDay, FBelfield, ADonald, ARowlands, MWibawa, JBrotherton, DStimson, LClark, VOwen, JBawden, LBox, GBone, EMortenson, PHardcastle, Avan Meurs, SEccles, SRaynaud, FAherne, W Discovery of 2-(6-{[(6-fluoroquinolin-2-yl)methyl]amino}bicyclo[3.1.0]hex-3-yl)-N-hydroxypyrimidine-5-carboxamide (CHR-3996), a class I selective orally active histone deacetylase inhibitor. J Med Chem 53:8663-78 (2010)  
Target
Name:
Cytochrome P450 3A4
Synonyms:
Albendazole monooxygenase CP3A4_HUMAN CYP3A4 CYPIIIA4 Cytochrome P450 3A4 (CYP3A4) Nifedipine oxidase Taurochenodeoxycholate 6-alpha-hydroxylase
Type:
Enzyme
Mol. Mass.:
57349.57
Organism:
Homo sapiens (Human)
Description:
Residue:
503
  
Inhibitor
Name:
BDBM50347387
Synonyms:
CHEMBL1801172
Type:
Small organic molecule
Emp. Form.:
C20H19N5O4S
Mol. Mass.:
425.461
SMILES:
ONC(=O)c1cnc(nc1)N1C[C@H]2[C@@H](C1)[C@@H]2NS(=O)(=O)c1ccc2ccccc2c1
: