Target
Ectonucleotide pyrophosphatase/phosphodiesterase family member 1
Ligand
BDBM50347445
Substrate
Meas. Tech.
ChEMBL_755236 (CHEMBL1806215)
Ki
20000±n/a nM
Citation
 Eliahu, SLecka, JReiser, GHaas, MBigonnesse, FLévesque, SAPelletier, JSévigny, JFischer, B Diadenosine 5',5''-(boranated)polyphosphonate analogues as selective nucleotide pyrophosphatase/phosphodiesterase inhibitors. J Med Chem 53:8485-97 (2010)  
Target
Name:
Ectonucleotide pyrophosphatase/phosphodiesterase family member 1
Synonyms:
ENPP1 M6S1 PC1 | PDNP1
Type:
PROTEIN
Mol. Mass.:
104934.43
Organism:
Homo sapiens (Human)
Description:
ChEMBL_1448940
Residue:
925
  
Inhibitor
Name:
BDBM50347445
Synonyms:
CHEMBL1802094
Type:
Small organic molecule
Emp. Form.:
C22H31BN10O19P5
Mol. Mass.:
905.22
SMILES:
[BH3-]P(=O)(OP([O-])(=O)CP([O-])(=O)OC[C@H]1O[C@H]([C@H](O)[C@@H]1O)n1cnc2c(N)ncnc12)OP([O-])(=O)CP([O-])(=O)OC[C@H]1O[C@H]([C@H](O)[C@@H]1O)n1cnc2c(N)ncnc12
: