Target
1-deoxy-D-xylulose 5-phosphate reductoisomerase
Ligand
BDBM50181153
Substrate
Meas. Tech.
ChEMBL_755773 (CHEMBL1803440)
Ki
130±n/a nM
Citation
 Deng, LDiao, JChen, PPujari, VYao, YCheng, GCrick, DCPrasad, BVSong, Y Inhibition of 1-deoxy-D-xylulose-5-phosphate reductoisomerase by lipophilic phosphonates: SAR, QSAR, and crystallographic studies. J Med Chem 54:4721-34 (2011)  
Target
Name:
1-deoxy-D-xylulose 5-phosphate reductoisomerase
Synonyms:
DXR_MYCTU | dxr
Type:
PROTEIN
Mol. Mass.:
42846.92
Organism:
Mycobacterium tuberculosis
Description:
ChEMBL_1474510
Residue:
413
  
Inhibitor
Name:
BDBM50181153
Synonyms:
3-(N-hydroxyacetamido)propylphosphonic acid CHEMBL205338 ammonium 3-(N-hydroxyacetamido)propylphosphonate
Type:
Small organic molecule
Emp. Form.:
C5H12NO5P
Mol. Mass.:
197.1262
SMILES:
CC(=O)N(O)CCCP(O)(O)=O
: