Target
Elongation factor 1-alpha 1
Ligand
BDBM50347602
Substrate
Meas. Tech.
ChEMBL_756745 (CHEMBL1805291)
Kd
8.15±n/a nM
Citation
 Yao, NChen, CYWu, CYMotonishi, KKung, HJLam, KS Novel flavonoids with antiproliferative activities against breast cancer cells. J Med Chem 54:4339-49 (2011)  
Target
Name:
Elongation factor 1-alpha 1
Synonyms:
EEF1A EF-1-alpha-1 EF1A Elongation factor Tu LENG7 eEF1A-1
Type:
PROTEIN
Mol. Mass.:
50156.41
Organism:
Homo sapiens (Human)
Description:
ChEMBL_756745
Residue:
462
  
Inhibitor
Name:
BDBM50347602
Synonyms:
CHEMBL1802815
Type:
Small organic molecule
Emp. Form.:
C37H35N5O4
Mol. Mass.:
613.7049
SMILES:
CC(C)CNc1nc2cc3c(cc2n1Cc1ccccc1)oc(cc3=O)-c1ccc(cc1)C(=O)N[C@@H](Cc1ccccc1)C(N)=O
: