Target
Ectonucleotide pyrophosphatase/phosphodiesterase family member 2
Ligand
BDBM50347713
Substrate
Meas. Tech.
ChEMBL_756213 (CHEMBL1804763)
IC50
147±n/a nM
Citation
 Albers, HMHendrickx, LJvan Tol, RJHausmann, JPerrakis, AOvaa, H Structure-based design of novel boronic acid-based inhibitors of autotaxin. J Med Chem 54:4619-26 (2011)  
Target
Name:
Ectonucleotide pyrophosphatase/phosphodiesterase family member 2
Synonyms:
ATX Autotaxin (ATX) ENPP2 Ectonucleotide Pyrophosphatase/Phosphodiesterase 2 (ENPP2) Extracellular lysophospholipase D PDNP2
Type:
Enzyme
Mol. Mass.:
99007.13
Organism:
Homo sapiens (Human)
Description:
Q13822
Residue:
863
  
Inhibitor
Name:
BDBM50347713
Synonyms:
CHEMBL1802468
Type:
Small organic molecule
Emp. Form.:
C24H18BFN2O5S
Mol. Mass.:
476.285
SMILES:
OB(O)c1ccc(NC(=O)c2ccc(\C=C3/SC(=O)N(Cc4ccc(F)cc4)C3=O)cc2)cc1
: