Target
Transforming protein RhoA
Ligand
BDBM50347733
Substrate
Meas. Tech.
ChEMBL_756282 (CHEMBL1805095)
IC50
2090±n/a nM
Citation
 Deng, JFeng, EMa, SZhang, YLiu, XLi, HHuang, HZhu, JZhu, WShen, XMiao, LLiu, HJiang, HLi, J Design and synthesis of small molecule RhoA inhibitors: a new promising therapy for cardiovascular diseases? J Med Chem 54:4508-22 (2011)  
Target
Name:
Transforming protein RhoA
Synonyms:
ARH12 RHO12 RHOA_HUMAN h12
Type:
PROTEIN
Mol. Mass.:
21766.89
Organism:
Homo sapiens (Human)
Description:
ChEMBL_966397
Residue:
193
  
Inhibitor
Name:
BDBM50347733
Synonyms:
CHEMBL1802534
Type:
Small organic molecule
Emp. Form.:
C20H23N5O6
Mol. Mass.:
429.4265
SMILES:
OC(=O)C1CCN(CC1)c1nc2ccc(cc2nc1N1CCC(CC1)C(O)=O)[N+]([O-])=O
: