Target
Interferon-induced, double-stranded RNA-activated protein kinase
Ligand
BDBM50347916
Substrate
Meas. Tech.
ChEMBL_756675 (CHEMBL1805140)
IC50
3000±n/a nM
Citation
 Bryk, RWu, KRaimundo, BCBoardman, PEChao, PConn, GLAnderson, ECole, JLDuffy, NPNathan, CGriffin, JH Identification of new inhibitors of protein kinase R guided by statistical modeling. Bioorg Med Chem Lett 21:4108-14 (2011)  
Target
Name:
Interferon-induced, double-stranded RNA-activated protein kinase
Synonyms:
E2AK2_HUMAN Eukaryotic translation initiation factor 2-alpha kinase 2 P1/eIF-2A protein kinase PRKR Protein kinase RNA-activated eIF-2A protein kinase 2 | p68 kinase
Type:
PROTEIN
Mol. Mass.:
62104.61
Organism:
Homo sapiens (Human)
Description:
ChEMBL_1467743
Residue:
551
  
Inhibitor
Name:
BDBM50347916
Synonyms:
CHEMBL1802488
Type:
Small organic molecule
Emp. Form.:
C14H11N3O4
Mol. Mass.:
285.2548
SMILES:
CN1C(=O)NC(=O)\C(=C/c2c[nH]c3ccc(O)cc23)C1=O
: