Target
Interferon-induced, double-stranded RNA-activated protein kinase
Ligand
BDBM50073765
Substrate
Meas. Tech.
ChEMBL_756675 (CHEMBL1805140)
IC50
3000±n/a nM
Citation
 Bryk, RWu, KRaimundo, BCBoardman, PEChao, PConn, GLAnderson, ECole, JLDuffy, NPNathan, CGriffin, JH Identification of new inhibitors of protein kinase R guided by statistical modeling. Bioorg Med Chem Lett 21:4108-14 (2011)  
Target
Name:
Interferon-induced, double-stranded RNA-activated protein kinase
Synonyms:
E2AK2_HUMAN Eukaryotic translation initiation factor 2-alpha kinase 2 P1/eIF-2A protein kinase PRKR Protein kinase RNA-activated eIF-2A protein kinase 2 | p68 kinase
Type:
PROTEIN
Mol. Mass.:
62104.61
Organism:
Homo sapiens (Human)
Description:
ChEMBL_1467743
Residue:
551
  
Inhibitor
Name:
BDBM50073765
Synonyms:
CHEMBL367625 | N*2*-((1R,2S)-2-Amino-cyclohexyl)-N*6*-(3-chloro-phenyl)-9-ethyl-9H-purine-2,6-diamine
Type:
Small organic molecule
Emp. Form.:
C19H24ClN7
Mol. Mass.:
385.894
SMILES:
CCn1cnc2c(Nc3cccc(Cl)c3)nc(N[C@@H]3CCCC[C@@H]3N)nc12
: