Target
Protein-S-isoprenylcysteine O-methyltransferase
Ligand
BDBM50348002
Substrate
Meas. Tech.
ChEMBL_757264 (CHEMBL1803640)
IC50
500±n/a nM
Citation
 Judd, WRSlattum, PMHoang, KCBhoite, LValppu, LAlberts, GBrown, BRoth, BOstanin, KHuang, LWettstein, DRichards, BWillardsen, JA Discovery and SAR of methylated tetrahydropyranyl derivatives as inhibitors of isoprenylcysteine carboxyl methyltransferase (ICMT). J Med Chem 54:5031-47 (2011)  
Target
Name:
Protein-S-isoprenylcysteine O-methyltransferase
Synonyms:
ICMT Isoprenylcysteine carboxyl methyltransferase | PCCMT
Type:
PROTEIN
Mol. Mass.:
31943.26
Organism:
Homo sapiens (Human)
Description:
ChEMBL_956034
Residue:
284
  
Inhibitor
Name:
BDBM50348002
Synonyms:
CHEMBL1800361
Type:
Small organic molecule
Emp. Form.:
C31H34N4O3S
Mol. Mass.:
542.692
SMILES:
CSCC[C@@H](NC(=O)c1ccc(CNCc2cnc[nH]2)cc1-c1ccccc1C)C(=O)OCc1ccccc1
: