Target
Egl nine homolog 1
Ligand
BDBM50348089
Substrate
Meas. Tech.
ChEMBL_757459 (CHEMBL1804279)
IC50
69700±n/a nM
Citation
 Kwon, HSChoi, YKKim, JWPark, YKYang, EGAhn, DR Inhibition of a prolyl hydroxylase domain (PHD) by substrate analog peptides. Bioorg Med Chem Lett 21:4325-8 (2011)  
Target
Name:
Egl nine homolog 1
Synonyms:
C1orf12 EGLN1_HUMAN Hypoxia-inducible factor prolyl hydroxylase 2 (HIF-PH2) Prolyl hydroxylase domain-containing protein 2 (PHD2)
Type:
Protein
Mol. Mass.:
46035.59
Organism:
Homo sapiens (Human)
Description:
Q9GZT9
Residue:
426
  
Inhibitor
Name:
BDBM50348089
Synonyms:
CHEMBL1800368
Type:
Small organic molecule
Emp. Form.:
C5H7NO2S
Mol. Mass.:
145.18
SMILES:
OC(=O)[C@@H]1CC(=S)CN1
: