Target
Carbonic anhydrase
Ligand
BDBM26187
Substrate
Meas. Tech.
ChEMBL_757508 (CHEMBL1804480)
Ki
13700±n/a nM
Citation
 Oztürk Sarikaya, SBTopal, FSentürk, MGülçin, ISupuran, CT In vitro inhibition ofa-carbonic anhydrase isozymes by some phenolic compounds. Bioorg Med Chem Lett 21:4259-62 (2011)  
Target
Name:
Carbonic anhydrase
Synonyms:
Type:
PROTEIN
Mol. Mass.:
32973.15
Organism:
Dicentrarchus labrax
Description:
ChEMBL_757508
Residue:
309
  
Inhibitor
Name:
BDBM26187
Synonyms:
α-CA inhibitor, 11 US9688816, 2 | phenol
Type:
Small organic molecule
Emp. Form.:
C6H6O
Mol. Mass.:
94.1112
SMILES:
Oc1ccccc1
: